Reaction Details
TargetProstaglandin G/H synthase 1
LigandBDBM50353674
Substrate/Competitorn/a
Meas. Tech.ChEMBL_770333 (CHEMBL1833642)
IC50 14±n/a nM
Citation Çalişkan, BLuderer, SÖzkan, YWerz, OBanoglu, E Pyrazol-3-propanoic acid derivatives as novel inhibitors of leukotriene biosynthesis in human neutrophils. Eur J Med Chem46:5021-33 (2011) 
 
Prostaglandin G/H synthase 1
Name:Prostaglandin G/H synthase 1
Type:Enzyme
Mol. Mass.:68692.62
Organism:Homo sapiens (Human)
Description:P23219
Residue:599
BDBM50353674
NameBDBM50353674
Synonyms:CHEMBL1830480
TypeSmall organic molecule
Emp. Form.C31H29N3O2
Mol. Mass.475.5809
SMILESCC(C)c1ccc(OC(=O)CCc2cc(-c3ccc(C)cc3)n(n2)-c2ccc3ccccc3n2)cc1