Reaction Details
TargetAcetylcholinesterase
LigandBDBM50353685
Substrate/Competitorn/a
Meas. Tech.ChEMBL_770411 (CHEMBL1833720)
IC50 41±n/a nM
Citation Tang, HZhao, LZZhao, HTHuang, SLZhong, SMQin, JKChen, ZFHuang, ZSLiang, H Hybrids of oxoisoaporphine-tacrine congeners: novel acetylcholinesterase and acetylcholinesterase-inducedß-amyloid aggregation inhibitors. Eur J Med Chem46:4970-9 (2011) 
 
Acetylcholinesterase
Name:Acetylcholinesterase
Type:Enzyme
Mol. Mass.:71812.79
Organism:Electrophorus electricus (Electric eel)
Description:n/a
Residue:633
BDBM50353685
NameBDBM50353685
Synonyms:CHEMBL1830626
TypeSmall organic molecule
Emp. Form.C33H29N5O2
Mol. Mass.527.6157
SMILESO=C(CNCCNc1c2CCCCc2nc2ccccc12)Nc1ccc-2c(c1)C(=O)c1cccc3ccnc-2c13