Reaction Details
TargetcAMP-specific 3',5'-cyclic phosphodiesterase 4A
LigandBDBM14774
Substrate/Competitorn/a
Meas. Tech.ChEMBL_769284 (CHEMBL1833211)
IC50 0.59±n/a nM
Citation Taltavull, JSerrat, JGràcia, JGavaldà, ACórdoba, MCalama, EMontero, JLAndrés, MMiralpeix, MVilella, DHernández, BBeleta, JRyder, HPagès, L Synthesis and biological activity of pyrido[3',2':4,5]furo[3,2-d]pyrimidine derivatives as novel and potent phosphodiesterase type 4 inhibitors. Eur J Med Chem46:4946-56 (2011) 
 
cAMP-specific 3',5'-cyclic phosphodiesterase 4A
Name:cAMP-specific 3',5'-cyclic phosphodiesterase 4A
Type:Enzyme
Mol. Mass.:98113.27
Organism:Homo sapiens (Human)
Description:P27815
Residue:886
BDBM14774
NameBDBM14774
Synonyms:3-(cyclopropylmethoxy)-N-(3,5-dichloropyridin-4-yl)-4-(difluoromethoxy)benzamide DAXAS Roflumilast
TypeSmall organic molecule
Emp. Form.C17H14Cl2F2N2O3
Mol. Mass.403.207
SMILESFC(F)Oc1ccc(cc1OCC1CC1)C(=O)Nc1c(Cl)cncc1Cl