Reaction Details
TargetD-amino-acid oxidase
LigandBDBM31172
Substrate/Competitorn/a
Meas. Tech.ChEMBL_769923 (CHEMBL1832107)
Kd 5.5±n/a nM
Citation Lange, JHVenhorst, Jvan Dongen, MJFrankena, JBassissi, Fde Bruin, NMden Besten, Cde Beer, SBOostenbrink, CMarkova, NKruse, CG Biophysical and physicochemical methods differentiate highly ligand-efficient human D-amino acid oxidase inhibitors. Eur J Med Chem46:4808-19 (2011) 
 
D-amino-acid oxidase
Name:D-amino-acid oxidase
Type:Homodimer
Mol. Mass.:39476.06
Organism:Homo sapiens (Human)
Description:P14920
Residue:347
BDBM31172
NameBDBM31172
Synonyms:3-hydroxyquinolin-2(1H)-one, 26
TypeSmall organic molecule
Emp. Form.C9H5ClFNO2
Mol. Mass.213.593
SMILESOc1cc2c(Cl)c(F)ccc2[nH]c1=O