Reaction Details
TargetPotassium voltage-gated channel subfamily H member 2
LigandBDBM31172
Substrate/Competitorn/a
Meas. Tech.ChEMBL_769927 (CHEMBL1832111)
IC50>10000±n/a nM
Citation Lange, JHVenhorst, Jvan Dongen, MJFrankena, JBassissi, Fde Bruin, NMden Besten, Cde Beer, SBOostenbrink, CMarkova, NKruse, CG Biophysical and physicochemical methods differentiate highly ligand-efficient human D-amino acid oxidase inhibitors. Eur J Med Chem46:4808-19 (2011) 
 
Potassium voltage-gated channel subfamily H member 2
Name:Potassium voltage-gated channel subfamily H member 2
Type:Multi-pass membrane protein
Mol. Mass.:126672.65
Organism:Homo sapiens (Human)
Description:Q12809
Residue:1159
BDBM31172
NameBDBM31172
Synonyms:3-hydroxyquinolin-2(1H)-one, 26
TypeSmall organic molecule
Emp. Form.C9H5ClFNO2
Mol. Mass.213.593
SMILESOc1cc2c(Cl)c(F)ccc2[nH]c1=O