Reaction Details
TargetVitamin D3 receptor
LigandBDBM50353862
Substrate/Competitorn/a
Meas. Tech.ChEMBL_769453 (CHEMBL1831393)
Ki 0.3±n/a nM
Citation Glebocka, ASicinski, RRPlum, LADeluca, HF Synthesis and biological activity of 2-(3'-hydroxypropylidene)-1a-hydroxy-19-norvitamin D analogues with shortened alkyl side chains. J Med Chem54:6832-42 (2011) 
 
Vitamin D3 receptor
Name:Vitamin D3 receptor
Type:PROTEIN
Mol. Mass.:47811.07
Organism:Rattus norvegicus
Description:ChEMBL_1505946
Residue:423
BDBM50353862
NameBDBM50353862
Synonyms:CHEMBL1830166
TypeSmall organic molecule
Emp. Form.C27H42O3
Mol. Mass.414.6206
SMILESCCC(C)(C)[C@H]1CC[C@H]2\C(CCC[C@]12C)=C\C=C1\C[C@@H](O)\C(=C/CCO)[C@H](O)C1=C