Reaction Details
Target5-hydroxytryptamine receptor 1A
LigandBDBM10838
Substrate/Competitorn/a
Meas. Tech.ChEMBL_769756 (CHEMBL1831562)
Ki 684±n/a nM
Citation Lebar, MDHahn, KNMutka, TMaignan, PMcClintock, JBAmsler, CDvan Olphen, AKyle, DEBaker, BJ CNS and antimalarial activity of synthetic meridianin and psammopemmin analogs. Bioorg Med Chem19:5756-62 (2011) 
 
5-hydroxytryptamine receptor 1A
Name:5-hydroxytryptamine receptor 1A
Type:n/a
Mol. Mass.:46122.49
Organism:Homo sapiens (Human)
Description:n/a
Residue:422
BDBM10838
NameBDBM10838
Synonyms:3-(2-aminopyrimidin-4-yl)-1H-indol-4-ol | Meridianin A
TypeSmall organic molecule
Emp. Form.C12H10N4O
Mol. Mass.226.234
SMILESNc1nccc(n1)-c1c[nH]c2cccc(O)c12