Reaction Details
Target5-hydroxytryptamine receptor 7
LigandBDBM50353902
Substrate/Competitorn/a
Meas. Tech.ChEMBL_769759 (CHEMBL1831565)
Ki 1985±n/a nM
Citation Lebar, MDHahn, KNMutka, TMaignan, PMcClintock, JBAmsler, CDvan Olphen, AKyle, DEBaker, BJ CNS and antimalarial activity of synthetic meridianin and psammopemmin analogs. Bioorg Med Chem19:5756-62 (2011) 
 
5-hydroxytryptamine receptor 7
Name:5-hydroxytryptamine receptor 7
Type:G Protein-Coupled Receptor (GPCR)
Mol. Mass.:53573.08
Organism:Homo sapiens (Human)
Description:P34969
Residue:479
BDBM50353902
NameBDBM50353902
Synonyms:CHEMBL1829959
TypeSmall organic molecule
Emp. Form.C13H12N4O
Mol. Mass.240.2606
SMILESCOc1cccc2[nH]cc(-c3ccnc(N)n3)c12