Reaction Details
TargetSodium-dependent noradrenaline transporter
LigandBDBM50319578
Substrate/Competitorn/a
Meas. Tech.ChEMBL_769841 (CHEMBL1831835)
IC50 4±n/a nM
Citation O'Neill, DJAdedoyin, ABray, JADeecher, DCFensome, AGoldberg, JAHarrison, JLeventhal, LMann, CMark, LNogle, LSullivan, NRSpangler, TBTerefenko, EATrybulski, EJUveges, AJVu, AWhiteside, GTZhang, P Discovery of novel selective norepinephrine inhibitors: 1-(2-morpholin-2-ylethyl)-3-aryl-1,3-dihydro-2,1,3-benzothiadiazole 2,2-dioxides (WYE-114152). J Med Chem54:6824-31 (2011) 
 
Sodium-dependent noradrenaline transporter
Name:Sodium-dependent noradrenaline transporter
Type:Multi-pass membrane protein
Mol. Mass.:69337.72
Organism:Homo sapiens (Human)
Description:P23975
Residue:617
BDBM50319578
NameBDBM50319578
Synonyms:(2S)-(4-[3-(2-Fluorophenyl)-2,2-dioxido-2,1,3-benzothiadiazol-1(3H)-yl]-1-(methylamino)butan-2-ol | CHEMBL1082458
TypeSmall organic molecule
Emp. Form.C17H20FN3O3S
Mol. Mass.365.422
SMILESCNC[C@@H](O)CCN1c2ccccc2N(c2ccccc2F)S1(=O)=O