Reaction Details
TargetAcetylcholine-binding protein
LigandBDBM50419177
Substrate/Competitorn/a
Meas. Tech.ChEMBL_770043 (CHEMBL1832418)
Ki 1258.93±n/a nM
Citation Akdemir, ARucktooa, PJongejan, AElk, RBertrand, SSixma, TKBertrand, DSmit, ABLeurs, Rde Graaf, Cde Esch, IJ Acetylcholine binding protein (AChBP) as template for hierarchical in silico screening procedures to identify structurally novel ligands for the nicotinic receptors. Bioorg Med Chem19:6107-19 (2011) 
 
Acetylcholine-binding protein
Name:Acetylcholine-binding protein
Type:n/a
Mol. Mass.:26055.52
Organism:Lymnaea stagnalis
Description:Soluble acetylcholine receptor
Residue:229
BDBM50419177
NameBDBM50419177
Synonyms:CHEMBL1831028
TypeSmall organic molecule
Emp. Form.C14H16N2
Mol. Mass.212.2902
SMILESC1CC2N(C1)CCc1c2[nH]c2ccccc12