Reaction Details
TargetAcetylcholine-binding protein
LigandBDBM50353947
Substrate/Competitorn/a
Meas. Tech.ChEMBL_770043 (CHEMBL1832418)
Ki 10000±n/a nM
Citation Akdemir, ARucktooa, PJongejan, AElk, RBertrand, SSixma, TKBertrand, DSmit, ABLeurs, Rde Graaf, Cde Esch, IJ Acetylcholine binding protein (AChBP) as template for hierarchical in silico screening procedures to identify structurally novel ligands for the nicotinic receptors. Bioorg Med Chem19:6107-19 (2011) 
 
Acetylcholine-binding protein
Name:Acetylcholine-binding protein
Type:n/a
Mol. Mass.:26055.52
Organism:Lymnaea stagnalis
Description:Soluble acetylcholine receptor
Residue:229
BDBM50353947
NameBDBM50353947
Synonyms:CHEMBL1831030
TypeSmall organic molecule
Emp. Form.C16H22N2
Mol. Mass.242.3593
SMILESCC1CCN(CCc2cc3ccccc3[nH]2)CC1