Reaction Details
TargetAcetylcholine-binding protein
LigandBDBM50419184
Substrate/Competitorn/a
Meas. Tech.ChEMBL_770043 (CHEMBL1832418)
Ki 12589.25±n/a nM
Citation Akdemir, ARucktooa, PJongejan, AElk, RBertrand, SSixma, TKBertrand, DSmit, ABLeurs, Rde Graaf, Cde Esch, IJ Acetylcholine binding protein (AChBP) as template for hierarchical in silico screening procedures to identify structurally novel ligands for the nicotinic receptors. Bioorg Med Chem19:6107-19 (2011) 
 
Acetylcholine-binding protein
Name:Acetylcholine-binding protein
Type:n/a
Mol. Mass.:26055.52
Organism:Lymnaea stagnalis
Description:Soluble acetylcholine receptor
Residue:229
BDBM50419184
NameBDBM50419184
Synonyms:CHEMBL1831046
TypeSmall organic molecule
Emp. Form.C20H19N
Mol. Mass.273.3716
SMILESNCC(c1ccccc1)c1ccc(cc1)-c1ccccc1