Reaction Details
TargetAcetylcholine-binding protein
LigandBDBM50419185
Substrate/Competitorn/a
Meas. Tech.ChEMBL_770043 (CHEMBL1832418)
Ki 1000±n/a nM
Citation Akdemir, ARucktooa, PJongejan, AElk, RBertrand, SSixma, TKBertrand, DSmit, ABLeurs, Rde Graaf, Cde Esch, IJ Acetylcholine binding protein (AChBP) as template for hierarchical in silico screening procedures to identify structurally novel ligands for the nicotinic receptors. Bioorg Med Chem19:6107-19 (2011) 
 
Acetylcholine-binding protein
Name:Acetylcholine-binding protein
Type:n/a
Mol. Mass.:26055.52
Organism:Lymnaea stagnalis
Description:Soluble acetylcholine receptor
Residue:229
BDBM50419185
NameBDBM50419185
Synonyms:CHEMBL1831048
TypeSmall organic molecule
Emp. Form.C13H15ClNOS
Mol. Mass.268.782
SMILESC[N+]1(CCO)Cc2sc3ccc(Cl)cc3c2C1