Reaction Details
TargetNeprilysin
LigandBDBM50354042
Substrate/Competitorn/a
Meas. Tech.ChEMBL_770450 (CHEMBL1833759)
IC50 0.51±n/a nM
Citation Misawa, KSuzuki, YTakahashi, SYoshimori, ATakasawa, RShibuya, YTanuma, S Structure-based design of dipeptide derivatives for the human neutral endopeptidase. Bioorg Med Chem19:5935-47 (2011) 
 
Neprilysin
Name:Neprilysin
Type:Enzyme
Mol. Mass.:85505.38
Organism:Homo sapiens (Human)
Description:P08473
Residue:750
BDBM50354042
NameBDBM50354042
Synonyms:CHEMBL1829585
TypeSmall organic molecule
Emp. Form.C29H32N2O5
Mol. Mass.488.5748
SMILESC[C@@H](CNC(=O)[C@H](Cc1ccc(cc1)-c1ccccc1)N[C@@H](CCc1ccccc1)C(O)=O)C(O)=O