Reaction Details
TargetMyelin-associated glycoprotein
LigandBDBM50354048
Substrate/Competitorn/a
Meas. Tech.ChEMBL_770761 (CHEMBL1837431)
Kd 1.8E5±n/a nM
Citation Zeng, YRademacher, CNycholat, CMFutakawa, SLemme, KErnst, BPaulson, JC High affinity sialoside ligands of myelin associated glycoprotein. Bioorg Med Chem Lett21:5045-9 (2011) 
 
Myelin-associated glycoprotein
Name:Myelin-associated glycoprotein
Type:PROTEIN
Mol. Mass.:69048.07
Organism:Homo sapiens (Human)
Description:ChEMBL_770764
Residue:626
BDBM50354048
NameBDBM50354048
Synonyms:CHEMBL1836307
TypeSmall organic molecule
Emp. Form.C30H53N2O19Si
Mol. Mass.773.8299
SMILESCC(=O)N[C@@H]1[C@@H](O)C[C@@](O[C@H]2[C@@H](O)[C@@H](CO)O[C@@H](O[C@H]3[C@@H](O)[C@@H](CO)O[C@@H](OCC[Si](C)(C)C)[C@@H]3NC(C)=O)[C@@H]2O)(O[C@H]1[C@H](O)[C@H](O)CO)C([O-])=O