Reaction Details
TargetMyelin-associated glycoprotein
LigandBDBM50354052
Substrate/Competitorn/a
Meas. Tech.ChEMBL_770762 (CHEMBL1837432)
IC50 272000±n/a nM
Citation Zeng, YRademacher, CNycholat, CMFutakawa, SLemme, KErnst, BPaulson, JC High affinity sialoside ligands of myelin associated glycoprotein. Bioorg Med Chem Lett21:5045-9 (2011) 
 
Myelin-associated glycoprotein
Name:Myelin-associated glycoprotein
Type:PROTEIN
Mol. Mass.:69048.07
Organism:Homo sapiens (Human)
Description:ChEMBL_770764
Residue:626
BDBM50354052
NameBDBM50354052
Synonyms:CHEMBL1836308
TypeSmall organic molecule
Emp. Form.C32H47N2O18S
Mol. Mass.779.784
SMILESCC(=O)N[C@@H]1[C@@H](O)C[C@@](O[C@H]2[C@@H](O)[C@@H](CO)O[C@@H](O[C@H]3[C@@H](O)[C@@H](CO)O[C@@H](Sc4ccc(C)cc4)[C@@H]3NC(C)=O)[C@@H]2O)(O[C@H]1[C@H](O)[C@H](O)CO)C([O-])=O