Reaction Details
TargetMyelin-associated glycoprotein
LigandBDBM50354060
Substrate/Competitorn/a
Meas. Tech.ChEMBL_770763 (CHEMBL1837433)
IC50 750±n/a nM
Citation Zeng, YRademacher, CNycholat, CMFutakawa, SLemme, KErnst, BPaulson, JC High affinity sialoside ligands of myelin associated glycoprotein. Bioorg Med Chem Lett21:5045-9 (2011) 
 
Myelin-associated glycoprotein
Name:Myelin-associated glycoprotein
Type:PROTEIN
Mol. Mass.:69048.07
Organism:Homo sapiens (Human)
Description:ChEMBL_770764
Residue:626
BDBM50354060
NameBDBM50354060
Synonyms:CHEMBL1836339
TypeSmall organic molecule
Emp. Form.C43H68N4O30
Mol. Mass.1121.0099
SMILESCOC(=O)[C@@H](NC(C)=O)[C@@H](C)O[C@H]1O[C@H](CO[C@@]2(C[C@H](O)[C@@H](NC(C)=O)[C@@H](O2)[C@H](O)[C@H](O)CO)C([O-])=O)[C@H](O)[C@H](O[C@@H]2O[C@H](CO)[C@H](O)[C@H](O[C@@]3(C[C@H](O)[C@@H](NC(C)=O)[C@@H](O3)[C@H](O)[C@H](O)CO)C([O-])=O)[C@H]2O)[C@H]1NC(C)=O