Reaction Details
TargetMyelin-associated glycoprotein
LigandBDBM50354056
Substrate/Competitorn/a
Meas. Tech.ChEMBL_770764 (CHEMBL1837434)
Kd 1.3E2±n/a nM
Citation Zeng, YRademacher, CNycholat, CMFutakawa, SLemme, KErnst, BPaulson, JC High affinity sialoside ligands of myelin associated glycoprotein. Bioorg Med Chem Lett21:5045-9 (2011) 
 
Myelin-associated glycoprotein
Name:Myelin-associated glycoprotein
Type:PROTEIN
Mol. Mass.:69048.07
Organism:Homo sapiens (Human)
Description:ChEMBL_770764
Residue:626
BDBM50354056
NameBDBM50354056
Synonyms:CHEMBL1836336
TypeSmall organic molecule
Emp. Form.C39H56FN4O22
Mol. Mass.951.8745
SMILESCOC(=O)[C@@H](NC(C)=O)[C@@H](C)O[C@H]1O[C@H](CO)[C@H](O)[C@H](O[C@@H]2O[C@H](CO)[C@H](O)[C@H](O[C@@]3(C[C@H](O)[C@@H](NC(C)=O)[C@@H](O3)[C@H](O)[C@H](O)CNC(=O)c3ccc(F)cc3)C([O-])=O)[C@H]2O)[C@H]1NC(C)=O