Reaction Details
TargetNeuropeptide Y receptor type 5
LigandBDBM50354066
Substrate/Competitorn/a
Meas. Tech.ChEMBL_770872 (CHEMBL1837820)
Ki 0.8±n/a nM
Citation Packiarajan, MMarzabadi, MRDesai, MLu, YNoble, SAWong, WCJubian, VChandrasena, GWolinsky, TDZhong, HWalker, MWWiborg, OAndersen, K Discovery of Lu AA33810: a highly selective and potent NPY5 antagonist with in vivo efficacy in a model of mood disorder. Bioorg Med Chem Lett21:5436-41 (2011) 
 
Neuropeptide Y receptor type 5
Name:Neuropeptide Y receptor type 5
Type:Enzyme
Mol. Mass.:50746.64
Organism:Homo sapiens (Human)
Description:Q15761
Residue:445
BDBM50354066
NameBDBM50354066
Synonyms:CHEMBL1836324
TypeSmall organic molecule
Emp. Form.C18H25N3O2S3
Mol. Mass.411.605
SMILESCCS(=O)(=O)NCCCCCNc1nc-2c(CCSc3ccccc-23)s1