Reaction Details
TargetHistone deacetylase 9
LigandBDBM50354085
Substrate/Competitorn/a
Meas. Tech.ChEMBL_770955 (CHEMBL1838194)
IC50 30000±n/a nM
Citation Wang, CHenkes, LMDoughty, LBHe, MWang, DMeyer-Almes, FJCheng, YQ Thailandepsins: bacterial products with potent histone deacetylase inhibitory activities and broad-spectrum antiproliferative activities. J Nat Prod74:2031-8 (2011) 
 
Histone deacetylase 9
Name:Histone deacetylase 9
Type:Enzyme
Mol. Mass.:111304.31
Organism:Homo sapiens (Human)
Description:Q9UKV0
Residue:1011
BDBM50354085
NameBDBM50354085
Synonyms:CHEMBL1836042
TypeSmall organic molecule
Emp. Form.C24H41N3O6S2
Mol. Mass.531.729
SMILESCCCC[C@H]1NC(=O)C[C@H](OC(=O)C[C@H](O)[C@H](NC(=O)[C@@H](CS)NC1=O)[C@@H](C)CC)\C=C\CCS