Reaction Details
TargetHistone deacetylase 4
LigandBDBM50354084
Substrate/Competitorn/a
Meas. Tech.ChEMBL_770951 (CHEMBL1838190)
IC50 22000±n/a nM
Citation Wang, CHenkes, LMDoughty, LBHe, MWang, DMeyer-Almes, FJCheng, YQ Thailandepsins: bacterial products with potent histone deacetylase inhibitory activities and broad-spectrum antiproliferative activities. J Nat Prod74:2031-8 (2011) 
 
Histone deacetylase 4
Name:Histone deacetylase 4
Type:Enzyme
Mol. Mass.:119049.39
Organism:Homo sapiens (Human)
Description:P56524
Residue:1084
BDBM50354084
NameBDBM50354084
Synonyms:CHEMBL1836145
TypeSmall organic molecule
Emp. Form.C24H39N3O6S2
Mol. Mass.529.713
SMILESCCCC[C@H]1NC(=O)C[C@@H]2OC(=O)C[C@H](O)[C@H](NC(=O)[C@@H](CSSCC\C=C\2)NC1=O)[C@@H](C)CC