Reaction Details
TargetHypoxia-inducible factor 1-alpha
LigandBDBM50354120
Substrate/Competitorn/a
Meas. Tech.ChEMBL_770820 (CHEMBL1837625)
IC50 160±n/a nM
Citation Huang, WHuang, RAttene-Ramos, MSSakamuru, SEnglund, EEInglese, JAustin, CPXia, M Synthesis and evaluation of quinazolin-4-ones as hypoxia-inducible factor-1a inhibitors. Bioorg Med Chem Lett21:5239-43 (2011) 
 
Hypoxia-inducible factor 1-alpha
Name:Hypoxia-inducible factor 1-alpha
Type:Protein
Mol. Mass.:92647.24
Organism:Homo sapiens (Human)
Description:Q16665
Residue:826
BDBM50354120
NameBDBM50354120
Synonyms:CHEMBL1836239
TypeSmall organic molecule
Emp. Form.C22H26N4O2
Mol. Mass.378.4674
SMILESCCOc1ccccc1-n1c(CN2CCCNCC2)nc2ccccc2c1=O