Reaction Details
TargetHypoxia-inducible factor 1-alpha
LigandBDBM50354124
Substrate/Competitorn/a
Meas. Tech.ChEMBL_770820 (CHEMBL1837625)
IC50 27500±n/a nM
Citation Huang, WHuang, RAttene-Ramos, MSSakamuru, SEnglund, EEInglese, JAustin, CPXia, M Synthesis and evaluation of quinazolin-4-ones as hypoxia-inducible factor-1a inhibitors. Bioorg Med Chem Lett21:5239-43 (2011) 
 
Hypoxia-inducible factor 1-alpha
Name:Hypoxia-inducible factor 1-alpha
Type:Protein
Mol. Mass.:92647.24
Organism:Homo sapiens (Human)
Description:Q16665
Residue:826
BDBM50354124
NameBDBM50354124
Synonyms:CHEMBL1836237
TypeSmall organic molecule
Emp. Form.C28H30N4O2
Mol. Mass.454.5634
SMILESCCOc1ccccc1-n1c(CN2CCN(Cc3ccccc3)CC2)nc2ccccc2c1=O