Reaction Details
TargetHypoxia-inducible factor 1-alpha
LigandBDBM50354129
Substrate/Competitorn/a
Meas. Tech.ChEMBL_770820 (CHEMBL1837625)
IC50 4200±n/a nM
Citation Huang, WHuang, RAttene-Ramos, MSSakamuru, SEnglund, EEInglese, JAustin, CPXia, M Synthesis and evaluation of quinazolin-4-ones as hypoxia-inducible factor-1a inhibitors. Bioorg Med Chem Lett21:5239-43 (2011) 
 
Hypoxia-inducible factor 1-alpha
Name:Hypoxia-inducible factor 1-alpha
Type:Protein
Mol. Mass.:92647.24
Organism:Homo sapiens (Human)
Description:Q16665
Residue:826
BDBM50354129
NameBDBM50354129
Synonyms:CHEMBL1836180
TypeSmall organic molecule
Emp. Form.C20H21N5O4
Mol. Mass.395.4118
SMILESCOc1ccc(cc1-n1c(CN2CCNCC2)nc2ccccc2c1=O)[N+]([O-])=O