Reaction Details
TargetSphingosine 1-phosphate receptor 1
LigandBDBM50354138
Substrate/Competitorn/a
Meas. Tech.ChEMBL_770832 (CHEMBL1837637)
EC50 3.16±n/a nM
Citation Demont, EHArpino, SBit, RACampbell, CADeeks, NDesai, SDowell, SJGaskin, PGray, JRHarrison, LAHaynes, AHeightman, TDHolmes, DSHumphreys, PGKumar, UMorse, MAOsborne, GJPanchal, TPhilpott, KLTaylor, SWatson, RWillis, RWitherington, J Discovery of a brain-penetrant S1P3-sparing direct agonist of the S1P¿? and S1P5 receptors efficacious at low oral dose. J Med Chem54:6724-33 (2011) 
 
Sphingosine 1-phosphate receptor 1
Name:Sphingosine 1-phosphate receptor 1
Type:Enzyme
Mol. Mass.:42836.02
Organism:Homo sapiens (Human)
Description:P21453
Residue:382
BDBM50354138
NameBDBM50354138
Synonyms:CHEMBL1836215
TypeSmall organic molecule
Emp. Form.C25H28N4O4
Mol. Mass.448.5142
SMILESCC(C)Oc1ccc(cc1C#N)-c1nc(no1)-c1ccc2CN(CCc2c1C)C(CO)CO