Reaction Details
TargetHistamine H3 receptor
LigandBDBM50354205
Substrate/Competitorn/a
Meas. Tech.ChEMBL_770621 (CHEMBL1839631)
Ki 1.8±n/a nM
Citation Zhou, DGross, JLSze, JYAdedoyin, ABBowlby, MDi, LPlatt, BJZhang, GBrandon, NComery, TARobichaud, AJ Pyrrolidin-3-yl-N-methylbenzamides as potent histamine 3 receptor antagonists. Bioorg Med Chem Lett21:5957-60 (2011) 
 
Histamine H3 receptor
Name:Histamine H3 receptor
Type:G Protein-Coupled Receptor (GPCR)
Mol. Mass.:48691.47
Organism:Homo sapiens (Human)
Description:Binding assays were using CHO cells stably expressing hH3R receptors.
Residue:445
BDBM50354205
NameBDBM50354205
Synonyms:CHEMBL1835999
TypeSmall organic molecule
Emp. Form.C19H24N4O
Mol. Mass.324.4201
SMILESCN([C@@H]1CCN(C1)C1CCC1)C(=O)c1ccc(cc1)-n1cccn1