Reaction Details
TargetHistamine H3 receptor
LigandBDBM50354210
Substrate/Competitorn/a
Meas. Tech.ChEMBL_770621 (CHEMBL1839631)
Ki 4.2±n/a nM
Citation Zhou, DGross, JLSze, JYAdedoyin, ABBowlby, MDi, LPlatt, BJZhang, GBrandon, NComery, TARobichaud, AJ Pyrrolidin-3-yl-N-methylbenzamides as potent histamine 3 receptor antagonists. Bioorg Med Chem Lett21:5957-60 (2011) 
 
Histamine H3 receptor
Name:Histamine H3 receptor
Type:G Protein-Coupled Receptor (GPCR)
Mol. Mass.:48691.47
Organism:Homo sapiens (Human)
Description:Binding assays were using CHO cells stably expressing hH3R receptors.
Residue:445
BDBM50354210
NameBDBM50354210
Synonyms:CHEMBL1836035
TypeSmall organic molecule
Emp. Form.C23H28N4O
Mol. Mass.376.4946
SMILESCC(C)N1CC[C@H](C1)N(C)C(=O)c1ccc(cc1)-n1c(C)nc2ccccc12