Reaction Details
TargetCarbonic anhydrase 12
LigandBDBM50354336
Substrate/Competitorn/a
Meas. Tech.ChEMBL_770798 (CHEMBL1837603)
Ki 7.9±n/a nM
Citation Morris, JCChiche, JGrellier, CLopez, MBornaghi, LFMaresca, ASupuran, CTPouysségur, JPoulsen, SA Targeting hypoxic tumor cell viability with carbohydrate-based carbonic anhydrase IX and XII inhibitors. J Med Chem54:6905-18 (2011) 
 
Carbonic anhydrase 12
Name:Carbonic anhydrase 12
Type:Enzyme
Mol. Mass.:39456.00
Organism:Homo sapiens (Human)
Description:Catalytic domain of human cloned isozyme was used in the assay
Residue:354
BDBM50354336
NameBDBM50354336
Synonyms:CHEMBL1834000
TypeSmall organic molecule
Emp. Form.C26H30N4O12S2
Mol. Mass.654.666
SMILESCC(=O)OC[C@H]1O[C@@H](SCc2nnn(c2C#CCO)-c2ccc(cc2)S(N)(=O)=O)[C@H](OC(C)=O)[C@@H](OC(C)=O)[C@@H]1OC(C)=O