Reaction Details
TargetCarbonic anhydrase 12
LigandBDBM50354337
Substrate/Competitorn/a
Meas. Tech.ChEMBL_770798 (CHEMBL1837603)
Ki 56±n/a nM
Citation Morris, JCChiche, JGrellier, CLopez, MBornaghi, LFMaresca, ASupuran, CTPouysségur, JPoulsen, SA Targeting hypoxic tumor cell viability with carbohydrate-based carbonic anhydrase IX and XII inhibitors. J Med Chem54:6905-18 (2011) 
 
Carbonic anhydrase 12
Name:Carbonic anhydrase 12
Type:Enzyme
Mol. Mass.:39456.00
Organism:Homo sapiens (Human)
Description:Catalytic domain of human cloned isozyme was used in the assay
Residue:354
BDBM50354337
NameBDBM50354337
Synonyms:CHEMBL1836633
TypeSmall organic molecule
Emp. Form.C21H30N4O14S2
Mol. Mass.626.611
SMILESNS(=O)(=O)c1ccc(cc1)-n1cc(CS(=O)(=O)[C@@H]2O[C@H](CO)[C@@H](O[C@H]3O[C@H](CO)[C@@H](O)[C@H](O)[C@H]3O)[C@H](O)[C@H]2O)nn1