Reaction Details
TargetCarbonic anhydrase 2
LigandBDBM50278780
Substrate/Competitorn/a
Meas. Tech.ChEMBL_770796 (CHEMBL1837601)
Ki 6.9±n/a nM
Citation Morris, JCChiche, JGrellier, CLopez, MBornaghi, LFMaresca, ASupuran, CTPouysségur, JPoulsen, SA Targeting hypoxic tumor cell viability with carbohydrate-based carbonic anhydrase IX and XII inhibitors. J Med Chem54:6905-18 (2011) 
 
Carbonic anhydrase 2
Name:Carbonic anhydrase 2
Type:Enzyme
Mol. Mass.:29250.71
Organism:Homo sapiens (Human)
Description:P00918
Residue:260
BDBM50278780
NameBDBM50278780
Synonyms:(2R,3R,4S,5R,6S)-2-(acetoxymethyl)-6-((1-(4-sulfamoylphenyl)-1H-1,2,3-triazol-4-yl)methylsulfonyl)tetrahydro-2H-pyran-3,4,5-triyl triacetate CHEMBL444912
TypeSmall organic molecule
Emp. Form.C23H28N4O13S2
Mol. Mass.632.617
SMILESCC(=O)OC[C@H]1O[C@H]([C@H](OC(C)=O)[C@@H](OC(C)=O)[C@@H]1OC(C)=O)S(=O)(=O)Cc1cn(nn1)-c1ccc(cc1)S(N)(=O)=O