Reaction Details
TargetCarbonic anhydrase 1
LigandBDBM50354344
Substrate/Competitorn/a
Meas. Tech.ChEMBL_770795 (CHEMBL1837600)
Ki 4070±n/a nM
Citation Morris, JCChiche, JGrellier, CLopez, MBornaghi, LFMaresca, ASupuran, CTPouysségur, JPoulsen, SA Targeting hypoxic tumor cell viability with carbohydrate-based carbonic anhydrase IX and XII inhibitors. J Med Chem54:6905-18 (2011) 
 
Carbonic anhydrase 1
Name:Carbonic anhydrase 1
Type:Enzyme
Mol. Mass.:28873.37
Organism:Homo sapiens (Human)
Description:P00915
Residue:261
BDBM50354344
NameBDBM50354344
Synonyms:CHEMBL1836626
TypeSmall organic molecule
Emp. Form.C23H27IN4O13S2
Mol. Mass.758.514
SMILESCC(=O)OC[C@H]1O[C@H]([C@H](OC(C)=O)[C@@H](OC(C)=O)[C@H]1OC(C)=O)S(=O)(=O)Cc1nnn(c1I)-c1ccc(cc1)S(N)(=O)=O