Reaction Details
TargetCarbonic anhydrase 12
LigandBDBM50354342
Substrate/Competitorn/a
Meas. Tech.ChEMBL_770798 (CHEMBL1837603)
Ki 53.1±n/a nM
Citation Morris, JCChiche, JGrellier, CLopez, MBornaghi, LFMaresca, ASupuran, CTPouysségur, JPoulsen, SA Targeting hypoxic tumor cell viability with carbohydrate-based carbonic anhydrase IX and XII inhibitors. J Med Chem54:6905-18 (2011) 
 
Carbonic anhydrase 12
Name:Carbonic anhydrase 12
Type:Enzyme
Mol. Mass.:39456.00
Organism:Homo sapiens (Human)
Description:Catalytic domain of human cloned isozyme was used in the assay
Residue:354
BDBM50354342
NameBDBM50354342
Synonyms:CHEMBL1836628
TypeSmall organic molecule
Emp. Form.C35H44N4O21S2
Mol. Mass.920.868
SMILESCC(=O)OC[C@H]1O[C@H](O[C@@H]2[C@@H](COC(C)=O)O[C@H]([C@H](OC(C)=O)[C@H]2OC(C)=O)S(=O)(=O)Cc2cn(nn2)-c2ccc(cc2)S(N)(=O)=O)[C@H](OC(C)=O)[C@@H](OC(C)=O)[C@@H]1OC(C)=O