Reaction Details
TargetCarbonic anhydrase 2
LigandBDBM50354404
Substrate/Competitorn/a
Meas. Tech.ChEMBL_770697 (CHEMBL1839822)
Ki 2140±n/a nM
Citation Knaus, EEInnocenti, AScozzafava, ASupuran, CT Phenylethynylbenzenesulfonamide regioisomers strongly and selectively inhibit the transmembrane, tumor-associated carbonic anhydrase isoforms IX and XII over the cytosolic isoforms I and II. Bioorg Med Chem Lett21:5892-6 (2011) 
 
Carbonic anhydrase 2
Name:Carbonic anhydrase 2
Type:Enzyme
Mol. Mass.:29250.71
Organism:Homo sapiens (Human)
Description:P00918
Residue:260
BDBM50354404
NameBDBM50354404
Synonyms:CHEMBL1836407
TypeSmall organic molecule
Emp. Form.C14H10FNO2S
Mol. Mass.275.298
SMILESNS(=O)(=O)c1cccc(c1)C#Cc1cccc(F)c1