Reaction Details
TargetCarbonic anhydrase 9
LigandBDBM50354405
Substrate/Competitorn/a
Meas. Tech.ChEMBL_770698 (CHEMBL1839823)
Ki 6370±n/a nM
Citation Knaus, EEInnocenti, AScozzafava, ASupuran, CT Phenylethynylbenzenesulfonamide regioisomers strongly and selectively inhibit the transmembrane, tumor-associated carbonic anhydrase isoforms IX and XII over the cytosolic isoforms I and II. Bioorg Med Chem Lett21:5892-6 (2011) 
 
Carbonic anhydrase 9
Name:Carbonic anhydrase 9
Type:Enzyme
Mol. Mass.:49669.03
Organism:Homo sapiens (Human)
Description:Catalytic domain of human cloned isozyme was used in the assay
Residue:459
BDBM50354405
NameBDBM50354405
Synonyms:CHEMBL1836408
TypeSmall organic molecule
Emp. Form.C14H11NO2S
Mol. Mass.257.308
SMILESNS(=O)(=O)c1ccccc1C#Cc1ccccc1