Reaction Details
TargetCarbonic anhydrase 12
LigandBDBM50354396
Substrate/Competitorn/a
Meas. Tech.ChEMBL_770699 (CHEMBL1839824)
Ki 9.4±n/a nM
Citation Knaus, EEInnocenti, AScozzafava, ASupuran, CT Phenylethynylbenzenesulfonamide regioisomers strongly and selectively inhibit the transmembrane, tumor-associated carbonic anhydrase isoforms IX and XII over the cytosolic isoforms I and II. Bioorg Med Chem Lett21:5892-6 (2011) 
 
Carbonic anhydrase 12
Name:Carbonic anhydrase 12
Type:Enzyme
Mol. Mass.:39456.00
Organism:Homo sapiens (Human)
Description:Catalytic domain of human cloned isozyme was used in the assay
Residue:354
BDBM50354396
NameBDBM50354396
Synonyms:CHEMBL1836399
TypeSmall organic molecule
Emp. Form.C14H11NO2S
Mol. Mass.257.308
SMILESNS(=O)(=O)c1ccc(cc1)C#Cc1ccccc1