Reaction Details
TargetProtein-tyrosine kinase 6
LigandBDBM50354409
Substrate/Competitorn/a
Meas. Tech.ChEMBL_771345 (CHEMBL1839617)
IC50 8±n/a nM
Citation Zeng, HBelanger, DBCurran, PJShipps, GWMiao, HBracken, JBArshad Siddiqui, MMalkowski, MWang, Y Discovery of novel imidazo[1,2-a]pyrazin-8-amines as Brk/PTK6 inhibitors. Bioorg Med Chem Lett21:5870-5 (2011) 
 
Protein-tyrosine kinase 6
Name:Protein-tyrosine kinase 6
Type:Tyrosine-protein kinase
Mol. Mass.:51839.11
Organism:Homo sapiens (Human)
Description:n/a
Residue:451
BDBM50354409
NameBDBM50354409
Synonyms:CHEMBL1836805
TypeSmall organic molecule
Emp. Form.C22H23ClN8O
Mol. Mass.450.924
SMILESCN1CCN(CC1)C(=O)c1ccc(Nc2nc(C)cn3c(cnc23)-c2cn[nH]c2)cc1Cl