Reaction Details
TargetProtein-tyrosine kinase 6
LigandBDBM50354430
Substrate/Competitorn/a
Meas. Tech.ChEMBL_771345 (CHEMBL1839617)
IC50 9±n/a nM
Citation Zeng, HBelanger, DBCurran, PJShipps, GWMiao, HBracken, JBArshad Siddiqui, MMalkowski, MWang, Y Discovery of novel imidazo[1,2-a]pyrazin-8-amines as Brk/PTK6 inhibitors. Bioorg Med Chem Lett21:5870-5 (2011) 
 
Protein-tyrosine kinase 6
Name:Protein-tyrosine kinase 6
Type:Tyrosine-protein kinase
Mol. Mass.:51839.11
Organism:Homo sapiens (Human)
Description:n/a
Residue:451
BDBM50354430
NameBDBM50354430
Synonyms:CHEMBL1836862
TypeSmall organic molecule
Emp. Form.C23H25FN8O
Mol. Mass.448.496
SMILESCc1cn2c(cnc2c(Nc2ccc(cc2F)C(=O)N2CCNCC2(C)C)n1)-c1cn[nH]c1