Reaction Details
TargetProtein-tyrosine kinase 6
LigandBDBM50354418
Substrate/Competitorn/a
Meas. Tech.ChEMBL_771345 (CHEMBL1839617)
IC50 10±n/a nM
Citation Zeng, HBelanger, DBCurran, PJShipps, GWMiao, HBracken, JBArshad Siddiqui, MMalkowski, MWang, Y Discovery of novel imidazo[1,2-a]pyrazin-8-amines as Brk/PTK6 inhibitors. Bioorg Med Chem Lett21:5870-5 (2011) 
 
Protein-tyrosine kinase 6
Name:Protein-tyrosine kinase 6
Type:Tyrosine-protein kinase
Mol. Mass.:51839.11
Organism:Homo sapiens (Human)
Description:n/a
Residue:451
BDBM50354418
NameBDBM50354418
Synonyms:CHEMBL1836847
TypeSmall organic molecule
Emp. Form.C25H25ClN8O
Mol. Mass.488.972
SMILESClc1cc(Nc2nc(cn3c(cnc23)-c2cn[nH]c2)C2CC2)ccc1C(=O)N1C[C@@H]2CC[C@H](C1)N2