Reaction Details
TargetProtein-tyrosine kinase 6
LigandBDBM50354437
Substrate/Competitorn/a
Meas. Tech.ChEMBL_771345 (CHEMBL1839617)
IC50 11±n/a nM
Citation Zeng, HBelanger, DBCurran, PJShipps, GWMiao, HBracken, JBArshad Siddiqui, MMalkowski, MWang, Y Discovery of novel imidazo[1,2-a]pyrazin-8-amines as Brk/PTK6 inhibitors. Bioorg Med Chem Lett21:5870-5 (2011) 
 
Protein-tyrosine kinase 6
Name:Protein-tyrosine kinase 6
Type:Tyrosine-protein kinase
Mol. Mass.:51839.11
Organism:Homo sapiens (Human)
Description:n/a
Residue:451
BDBM50354437
NameBDBM50354437
Synonyms:CHEMBL1836796
TypeSmall organic molecule
Emp. Form.C19H21N9
Mol. Mass.375.4303
SMILESCc1cn2c(cnc2c(Nc2ccnc(c2)N2CCNCC2)n1)-c1cn[nH]c1