Reaction Details
TargetProto-oncogene tyrosine-protein kinase Src
LigandBDBM50354478
Substrate/Competitorn/a
Meas. Tech.ChEMBL_771562 (CHEMBL1837741)
Ki 2810±n/a nM
Citation Radi, MBrullo, CCrespan, ETintori, CMusumeci, FBiava, MSchenone, SDreassi, EZamperini, CMaga, GPagano, DAngelucci, ABologna, MBotta, M Identification of potent c-Src inhibitors strongly affecting the proliferation of human neuroblastoma cells. Bioorg Med Chem Lett21:5928-33 (2011) 
 
Proto-oncogene tyrosine-protein kinase Src
Name:Proto-oncogene tyrosine-protein kinase Src
Type:Protein
Mol. Mass.:59838.60
Organism:Homo sapiens (Human)
Description:P12931
Residue:536
BDBM50354478
NameBDBM50354478
Synonyms:CHEMBL1836676
TypeSmall organic molecule
Emp. Form.C22H22FN5S
Mol. Mass.407.507
SMILESCSc1nc(NCc2ccc(F)cc2)c2cnn(CC(C)c3ccccc3)c2n1