Reaction Details
TargetProto-oncogene tyrosine-protein kinase Src
LigandBDBM50354487
Substrate/Competitorn/a
Meas. Tech.ChEMBL_771562 (CHEMBL1837741)
Ki 151±n/a nM
Citation Radi, MBrullo, CCrespan, ETintori, CMusumeci, FBiava, MSchenone, SDreassi, EZamperini, CMaga, GPagano, DAngelucci, ABologna, MBotta, M Identification of potent c-Src inhibitors strongly affecting the proliferation of human neuroblastoma cells. Bioorg Med Chem Lett21:5928-33 (2011) 
 
Proto-oncogene tyrosine-protein kinase Src
Name:Proto-oncogene tyrosine-protein kinase Src
Type:Protein
Mol. Mass.:59838.60
Organism:Homo sapiens (Human)
Description:P12931
Residue:536
BDBM50354487
NameBDBM50354487
Synonyms:CHEMBL270958
TypeSmall organic molecule
Emp. Form.C20H17ClFN5
Mol. Mass.381.834
SMILESFc1ccccc1CNc1ncnc2n(CC(Cl)c3ccccc3)ncc12