Reaction Details
TargetTyrosine-protein kinase ABL1
LigandBDBM50354484
Substrate/Competitorn/a
Meas. Tech.ChEMBL_771564 (CHEMBL1837743)
Ki 64±n/a nM
Citation Radi, MBrullo, CCrespan, ETintori, CMusumeci, FBiava, MSchenone, SDreassi, EZamperini, CMaga, GPagano, DAngelucci, ABologna, MBotta, M Identification of potent c-Src inhibitors strongly affecting the proliferation of human neuroblastoma cells. Bioorg Med Chem Lett21:5928-33 (2011) 
 
Tyrosine-protein kinase ABL1
Name:Tyrosine-protein kinase ABL1
Type:Enzyme
Mol. Mass.:122897.30
Organism:Homo sapiens (Human)
Description:P00519
Residue:1130
BDBM50354484
NameBDBM50354484
Synonyms:CHEMBL1629808
TypeSmall organic molecule
Emp. Form.C21H19BrClN5S
Mol. Mass.488.831
SMILESCSc1nc(NCc2cccc(Br)c2)c2cnn(CC(Cl)c3ccccc3)c2n1