Reaction Details
TargetRibosyldihydronicotinamide dehydrogenase [quinone]
LigandBDBM50354532
Substrate/Competitorn/a
Meas. Tech.ChEMBL_771623 (CHEMBL1837963)
IC50 74±n/a nM
Citation Dunstan, MSBarnes, JHumphries, MWhitehead, RCBryce, RALeys, DStratford, IJNolan, KA Novel inhibitors of NRH:quinone oxidoreductase 2 (NQO2): crystal structures, biochemical activity, and intracellular effects of imidazoacridin-6-ones. J Med Chem54:6597-611 (2011) 
 
Ribosyldihydronicotinamide dehydrogenase [quinone]
Name:Ribosyldihydronicotinamide dehydrogenase [quinone]
Type:Protein
Mol. Mass.:25917.25
Organism:Homo sapiens (Human)
Description:P16083
Residue:231
BDBM50354532
NameBDBM50354532
Synonyms:CHEMBL1836818
TypeSmall organic molecule
Emp. Form.C19H19BrN4O
Mol. Mass.399.284
SMILESCN(C)CCNc1ccc2nc(C)n3c2c1c(=O)c1cc(Br)ccc31