Reaction Details
TargetRibosyldihydronicotinamide dehydrogenase [quinone]
LigandBDBM50354536
Substrate/Competitorn/a
Meas. Tech.ChEMBL_771623 (CHEMBL1837963)
IC50 73±n/a nM
Citation Dunstan, MSBarnes, JHumphries, MWhitehead, RCBryce, RALeys, DStratford, IJNolan, KA Novel inhibitors of NRH:quinone oxidoreductase 2 (NQO2): crystal structures, biochemical activity, and intracellular effects of imidazoacridin-6-ones. J Med Chem54:6597-611 (2011) 
 
Ribosyldihydronicotinamide dehydrogenase [quinone]
Name:Ribosyldihydronicotinamide dehydrogenase [quinone]
Type:Protein
Mol. Mass.:25917.25
Organism:Homo sapiens (Human)
Description:P16083
Residue:231
BDBM50354536
NameBDBM50354536
Synonyms:CHEMBL1836823
TypeSmall organic molecule
Emp. Form.C20H22N4O3
Mol. Mass.366.4137
SMILESCOc1ccc2c(c1)c(=O)c1c(NCC[N+](C)(C)[O-])ccc3nc(C)n2c13