Reaction Details
TargetRibosyldihydronicotinamide dehydrogenase [quinone]
LigandBDBM50008344
Substrate/Competitorn/a
Meas. Tech.ChEMBL_771623 (CHEMBL1837963)
IC50 54±n/a nM
Citation Dunstan, MSBarnes, JHumphries, MWhitehead, RCBryce, RALeys, DStratford, IJNolan, KA Novel inhibitors of NRH:quinone oxidoreductase 2 (NQO2): crystal structures, biochemical activity, and intracellular effects of imidazoacridin-6-ones. J Med Chem54:6597-611 (2011) 
 
Ribosyldihydronicotinamide dehydrogenase [quinone]
Name:Ribosyldihydronicotinamide dehydrogenase [quinone]
Type:Protein
Mol. Mass.:25917.25
Organism:Homo sapiens (Human)
Description:P16083
Residue:231
BDBM50008344
NameBDBM50008344
Synonyms:5-(2-(diethylamino)ethylamino)-8-hydroxy-1-methyl-6H-imidazo[4,5,1-de]acridin-6-one CHEMBL125082 | NSC-637992
TypeSmall organic molecule
Emp. Form.C21H24N4O2
Mol. Mass.364.4409
SMILESCCN(CC)CCNc1ccc2nc(C)n3c2c1c(=O)c1cc(O)ccc31