Reaction Details
TargetRibosyldihydronicotinamide dehydrogenase [quinone]
LigandBDBM83846
Substrate/Competitorn/a
Meas. Tech.ChEMBL_771623 (CHEMBL1837963)
IC50 83±n/a nM
Citation Dunstan, MSBarnes, JHumphries, MWhitehead, RCBryce, RALeys, DStratford, IJNolan, KA Novel inhibitors of NRH:quinone oxidoreductase 2 (NQO2): crystal structures, biochemical activity, and intracellular effects of imidazoacridin-6-ones. J Med Chem54:6597-611 (2011) 
 
Ribosyldihydronicotinamide dehydrogenase [quinone]
Name:Ribosyldihydronicotinamide dehydrogenase [quinone]
Type:Protein
Mol. Mass.:25917.25
Organism:Homo sapiens (Human)
Description:P16083
Residue:231
BDBM83846
NameBDBM83846
Synonyms:5-(2-(dimethylamino)ethylamino)-8-hydroxy-6H-imidazo[4,5,1-de]acridin-6-one SMR001565157 | cid_371509
TypeSmall organic molecule
Emp. Form.C18H19ClN4O2
Mol. Mass.358.822
SMILESCl.CN(C)CCNc1ccc2ncn3c2c1c(=O)c1cc(O)ccc31