Reaction Details
TargetDelta-type opioid receptor
LigandBDBM50354573
Substrate/Competitorn/a
Meas. Tech.ChEMBL_771899 (CHEMBL1839053)
Ki 3±n/a nM
Citation Cami-Kobeci, GPolgar, WEKhroyan, TVToll, LHusbands, SM Structural determinants of opioid and NOP receptor activity in derivatives of buprenorphine. J Med Chem54:6531-7 (2011) 
 
Delta-type opioid receptor
Name:Delta-type opioid receptor
Type:G Protein-Coupled Receptor (GPCR)
Mol. Mass.:40382.98
Organism:Homo sapiens (Human)
Description:Competition binding assays were carried out using membrane preparations from transfected HN9.10 cells that constitutively expressed the delta opioid receptor.
Residue:372
BDBM50354573
NameBDBM50354573
Synonyms:CHEMBL1834412
TypeSmall organic molecule
Emp. Form.C35H45NO4
Mol. Mass.543.7361
SMILESCO[C@]12CC[C@@]3(C[C@@H]1[C@@](C)(O)c1ccc(cc1)C(C)(C)C)[C@H]1Cc4ccc(O)c5O[C@@H]2[C@]3(CCN1CC1CC1)c45