Reaction Details
TargetNociceptin receptor
LigandBDBM50004178
Substrate/Competitorn/a
Meas. Tech.ChEMBL_771035 (CHEMBL1838557)
EC50 8.1±n/a nM
Citation Cami-Kobeci, GPolgar, WEKhroyan, TVToll, LHusbands, SM Structural determinants of opioid and NOP receptor activity in derivatives of buprenorphine. J Med Chem54:6531-7 (2011) 
 
Nociceptin receptor
Name:Nociceptin receptor
Type:G Protein-Coupled Receptor (GPCR)
Mol. Mass.:40702.87
Organism:Homo sapiens (Human)
Description:P41146
Residue:370
BDBM50004178
NameBDBM50004178
Synonyms:Nociceptin ORPHANIN FQ
TypeSmall organic molecule
Emp. Form.C79H129N27O22
Mol. Mass.1809.0373
SMILESCC(C)C[C@H](NC(=O)[C@H](CCCCN)NC(=O)[C@H](CCCNC(N)=N)NC(=O)[C@H](C)NC(=O)[C@H](CO)NC(=O)[C@H](CCCCN)NC(=O)[C@H](CCCNC(N)=N)NC(=O)[C@H](C)NC(=O)CNC(=O)[C@@H](NC(=O)[C@H](Cc1ccccc1)NC(=O)CNC(=O)CNC(=O)[C@@H](N)Cc1ccccc1)[C@@H](C)O)C(=O)N[C@@H](C)C(=O)N[C@@H](CC(N)=O)C(=O)N[C@@H](CCC(N)=O)C(O)=O