Reaction Details
TargetMu-type opioid receptor
LigandBDBM50354575
Substrate/Competitorn/a
Meas. Tech.ChEMBL_771898 (CHEMBL1838909)
Ki 14±n/a nM
Citation Cami-Kobeci, GPolgar, WEKhroyan, TVToll, LHusbands, SM Structural determinants of opioid and NOP receptor activity in derivatives of buprenorphine. J Med Chem54:6531-7 (2011) 
 
Mu-type opioid receptor
Name:Mu-type opioid receptor
Type:G Protein-Coupled Receptor (GPCR)
Mol. Mass.:44789.51
Organism:Homo sapiens (Human)
Description:P35372
Residue:400
BDBM50354575
NameBDBM50354575
Synonyms:CHEMBL1834414
TypeSmall organic molecule
Emp. Form.C29H40BrNO4
Mol. Mass.546.536
SMILESCO[C@]12CC[C@@]3(C[C@@H]1[C@@](C)(O)C(C)(C)C)[C@H]1Cc4c5c(O[C@@H]2[C@@]35CCN1CC1CC1)c(O)cc4Br