Reaction Details
Target5-hydroxytryptamine receptor 6
LigandBDBM50354585
Substrate/Competitorn/a
Meas. Tech.ChEMBL_771219 (CHEMBL1839301)
Ki 7.90±n/a nM
Citation van Loevezijn, AVenhorst, JIwema Bakker, WIde Korte, CGde Looff, WVerhoog, Svan Wees, JWvan Hoeve, Mvan de Woestijne, RPvan der Neut, MABorst, AJvan Dongen, MJde Bruin, NMKeizer, HGKruse, CG N'-(arylsulfonyl)pyrazoline-1-carboxamidines as novel, neutral 5-hydroxytryptamine 6 receptor (5-HT6R) antagonists with unique structural features. J Med Chem54:7030-54 (2011) 
 
5-hydroxytryptamine receptor 6
Name:5-hydroxytryptamine receptor 6
Type:G Protein-Coupled Receptor (GPCR)
Mol. Mass.:46968.43
Organism:Homo sapiens (Human)
Description:P50406
Residue:440
BDBM50354585
NameBDBM50354585
Synonyms:CHEMBL1834226
TypeSmall organic molecule
Emp. Form.C14H19ClN4O2S
Mol. Mass.342.844
SMILESCCN=C(NS(=O)(=O)c1cccc(Cl)c1)N1CC(CC)C=N1